{"text_format":"1","workbook":"xlsx","n_sheets":8,"sheets":["Beregning","Rør","Info","Heat emitters","Definitions","Beregn","Ark2","Ark3"],"not_rendered":{"charts":0,"images":10,"macros":1,"external_links":0,"defined_names":4,"comments":2,"pivot_tables":0},"unopened":[],"bounds":{"document_bytes":16777216,"sheet_cells":100000,"rows_first":2000,"rows_last":500,"rows_between":2000,"halvings":0,"cell_chars":16384,"cell_head_chars":4096},"cells_cut":0,"cells_raw":0,"read":"whole","date_system":"1900"}

{"sheet":"Beregning","index":0,"n_rows":117,"n_cols":28,"rows_kept":117,"cut":false,"hidden":true,"merged":[[75,1,75,4],[3,1,3,12],[4,1,6,18],[1,1,2,19]]}
[]
[null,"Vurdering af radiatorerernes og gulvvarmens (varmeafgiveres) egnethed til varmepumpe    "]
[]
[]
[null,"Bemærk, at der er flere faneblade i regnearket. Der indtastes kun i gule felter i varmeafgivere, beregning og rør. Data for varmeanlægget indtastes i fanebladet \"Beregning\". Her ses også beregningsresultater i de orange og grønne felter. Orange felter sammenlignes: Er husets varmebehov større end den installerede radiatoreffekt? Hvis ja, så er varmegiverne ikke egnet til det ønskede varmeanlæg, med mindre der udvides med flere radiatorer eller gulvvarme. Alle gule felter skal udfyldes (indeholder p.t. eksempeltekst)."]
[]
[]
[]
[null,"Data for radiatorer skal udfyldes i fanebladet \"Varmeafgivere\". Billeder af de forskellige radiatorer ses i fanebladet \"Billeder\"."]
[null,"Der kan skiftes mellem fanebladene nederst på arket."]
[null,"Både arket \"Beregning\" og arket \"Varmegivere\" skal være udfyldt, før din beregning er foretaget. "]
[]
[null,"Arket kan anvendes til både en- og tostrengs varmeanlæg, dog skal særskilt vurdering af flowforholdene foretages i tilfælde, hvor særlige en-strengsarmaturer er anvendt."]
[null,"Varmepumper dimensioneres ofte til - 7 °C udetemperatur, men der angives også data for - 12 °C. Den nødvendige varmepumpeydelse skal være svare til husets varmebehov ved - 7 °C tillagt 500 W aht. varmtvandsproduktion."]
[null,"Under rør beregnes tryktabet for rørene tættest på varmepumpen. Dette bør næppe være større end ca 10 kPa. Der er typisk 15 kPa over kondensatoren og der skal være ca 10 kPa over radiatorventilerne. "]
[null,"Fordelingsrørene kan godt være begrænsende for flowet."]
[null,"Husets varmebehov ved -7°C ude og effekten af varmeanlæg inkl. gulvvarme ved radiator-middeltemperaturen, som begge er markeret med orange skal være så tætte på hinanden som muligt."]
[null,"Hvis effekten af varmeanlæg inkl. gulvvarme ved middeltemperaturen er lavere end husets varmebehov ved -7°C ude betyder det, at varmeanlægget kapacitet er for lille."]
[null,"Dette betyder, at fremløbstemperaturen (maks. fremløbstemperatur) bliver højere end den ønskede."]
[]
{"$rows_left_out":98}
{"sheet":"Rør","index":1,"n_rows":41,"n_cols":15,"rows_kept":41,"cut":false,"hidden":true,"merged":[]}
[null,null,null,null,null,null,null,null,null,null,null,null,null,"rel Ru",{"$f":"0.05/F2","v":2.5000000000000001E-3}]
[null,"Rørdiameter indvendig",null,null,null,20,"mm",null,null,null,null,null,null,"ny",{"$f":"vi(AVERAGE(Beregning!J45))","v":5.3663398254555465E-7}]
[null,null,null,null,null,null,null,null,null,null,null,null,null,"Re",{"$f":"H8*(F2/1000)/O2","v":34841.630405581542}]
[null,"Rørlængde ",null,null,null,20,"m",null,null,null,null,null,null,"Fric",{"$f":"fricfac(O3,O1)","v":2.8561423123939382E-2}]
[null,null,null,null,null,null,null,null,null,null,null,null,null,"Hjælpestørrelser"]
[null,"Sum zeta",null,null,null,5]
[]
[null,"Hastighed",null,null,null,null,null,{"$f":"Beregning!J64/3600/(PI()/4*(F2/1000)^2)","v":0.93486014414637564}]
[]
[null,"Pdyn Pa",null,null,null,null,null,{"$f":"0.5*1000*H8^2","v":436.98174455669113}]
[]
[null,"Tryktab enkeltmodstande Pa",null,null,null,null,null,{"$f":"H10*F6","v":2184.9087227834557}]
[]
[null,"Tryktab rør Pa",null,null,null,null,null,{"$f":"O4*F4/(F2/1000)*H10","v":12480.820503720852}]
[]
[null,"Tryktab Pa",null,null,null,null,null,{"$f":"H12+H14","v":14665.729226504307},"=",{"$f":"H16/1000","v":14.665729226504308},"kPa","=",{"$f":"J16/9.81","v":1.4949774950565042},"mVS"]
[]
[]
[null,"Varmepumpe kondensator",null,null,15,"kPa"]
[null,"Termostatventiler",null,null,10]
{"$rows_left_out":22}
{"sheet":"Info","index":2,"n_rows":2,"n_cols":2,"rows_kept":2,"cut":false,"hidden":false,"merged":[]}
[]
[null,"Info"]

{"sheet":"Heat emitters","index":3,"n_rows":46,"n_cols":84,"rows_kept":46,"cut":false,"hidden":false,"merged":[[4,27,6,27],[2,1,2,17],[11,15,11,17],[11,19,11,21],[11,9,11,13],[4,25,6,25]]}
[]
[null,{"$f":"IF(AR5=\"Dansk\",\"Opmåling af radiatorers (varmegiveres) og gulvvarmes ydelse\",\"Measuring the performance (thermal output) of radiators (emitters) and underfloor heating\")","v":"Measuring the performance (thermal output) of radiators (emitters) and underfloor heating"}]
[]
[]
[null,{"$f":"IF(AR5=\"Dansk\",\"Dimensionerende fremløbstemperatur\",\"Design forward temperature\")","v":"Design forward temperature"},null,null,null,null,60,null,null,"°C",null,null,null,null,null,null,null,null,null,null,null,null,null,null,null,{"$f":"IF(AR5=\"Dansk\",\"Samlet reference ydelse\",\"Total reference performance\")","v":"Total reference performance"},null,{"$f":"IF(AR5=\"Dansk\",\"Samlet design ydelse\",\"Total design performance\")","v":"Total design performance"},null,null,null,null,null,null,null,null,null,null,{"$f":"IF(AR5=\"Dansk\",\"Vælg sprog\",\"Choose language\")","v":"Choose language"},null,null,null,null,"Engelsk"]
[]
[null,{"$f":"IF(AR5=\"Dansk\",\"Dimensionerende returtemperatur\",\"Design return temperature\")","v":"Design return temperature"},null,null,null,null,40,null,null,"°C"]
[]
[null,{"$f":"IF(AR5=\"Dansk\",\"Dimensionerende rumtemperatur\",\"Design room temperature\")","v":"Design room temperature"},null,null,null,null,20,null,null,"°C",null,null,null,null,null,null,null,null,null,null,null,null,null,null,null,{"$f":"SUM(Z17:Z41)","v":12192.066283161455},null,{"$f":"SUM(AB17:AB41)","v":5069.3263250457567}]
[]
[]
[null,{"$f":"IF(AR5=\"Dansk\",\"Rum\",\"Room\")","v":"Room"},null,"Type",null,null,null,null,null,{"$f":"IF(AR5=\"Dansk\",\"Panelradiator/konvektor\",\"Panel radiator/convector\")","v":"Panel radiator/convector"},null,null,null,null,null,{"$f":"IF(AR5=\"Dansk\",\"Planradiator\",\"Planar radiator\")","v":"Planar radiator"},null,null,null,{"$f":"IF(AR5=\"Dansk\",\"Søjleradiator\",\"Column radiator\")","v":"Column radiator"},null,null,null,{"$f":"IF(AR5=\"Dansk\",\"Gulvvarme\",\"Underfloor heating\")","v":"Underfloor heating"},null,{"$f":"IF(AR5=\"Dansk\",\"Reference ydelse\",\"Reference performance\")","v":"Reference performance"},null,{"$f":"IF(AR5=\"Dansk\",\"Design ydelse\",\"Design performance\")","v":"Design performance"},null,null,null,null,null,null,null,null,null,null,null,null,null,null,null,null,null,null,null,null,null,null,null,null,null,null,null,null,"1. plade","2. plade","3. plade","1. konvektorblik","2. til … konvektorblik","randeffekt",null,"1. plade","2. plade","3. plade","konvektorer",null,"enkelt","dobbelt",null,null,null,null,null,null,"konvektor","Plan","søjle","gulvvarme"]
[null,null,null,null,null,null,null,null,null,null,null,null,null,null,null,null,null,null,null,null,null,null,null,null,null,null,null,null,null,null,null,null,null,null,null,null,null,null,"Kedeltype",null,"Type",null,"Panel",null,"Konvektor",null,"Plan",null,"Sprog"]
[null,null,null,null,null,null,{"$f":"IF(AR5=\"Dansk\",\"Højde\",\"Height\")","v":"Height"},null,null,{"$f":"IF(AR5=\"Dansk\",\"Bredde/længde\",\"With/Length\")","v":"With/Length"},null,{"$f":"IF(AR5=\"Dansk\",\"Antal paneler\",\"Number of panels\")","v":"Number of panels"},null,{"$f":"IF(AR5=\"Dansk\",\"Konvektorslør\",\"Convector veiling\")","v":"Convector veiling"},null,{"$f":"IF(AR5=\"Dansk\",\"Dybde\",\"Debth\")","v":"Debth"},null,"Type",null,{"$f":"IF(AR5=\"Dansk\",\"Søjlens dybde\",\"Column debth\")","v":"Column debth"},null,{"$f":"IF(AR5=\"Dansk\",\"Antal elementer\",\"Number of elements\")","v":"Number of elements"},null,{"$f":"IF(AR5=\"Dansk\",\"Areal\",\"Area\")","v":"Area"},null,{"$f":"IF(AR5=\"Dansk\",\"Ved 90/70/20 °C\",\"At 90/70/20 °C\")","v":"At 90/70/20 °C"},null,{"$f":"IF(AR5=\"Dansk\",\"Ved middeltemp.\",\"At middle temp.\")","v":"At middle temp."},null,null,null,null,null,null,null,null,null,null,null,null,null,null,null,null,0]
[null,null,null,null,null,null,"cm",null,null,"cm",null,{"$f":"IF(AR5=\"Dansk\",\"stk.\",\"pieces\")","v":"pieces"},null,{"$f":"IF(AR5=\"Dansk\",\"stk.\",\"pieces\")","v":"pieces"},null,"mm",null,{"$f":"IF(AR5=\"Dansk\",\"Antal lag\",\"Number of plates\")","v":"Number of plates"},null,"mm",null,{"$f":"IF(AR5=\"Dansk\",\"stk.\",\"pieces\")","v":"pieces"},null,"m²",null,"Watt",null,"Watt",null,null,null,null,null,null,null,null,null,null,"Gaskedel",null,{"$f":"IF(AR5=\"Dansk\",\"Panelradiator\",\"Panel radiator/convector\")","v":"Panel radiator/convector"},null,1,null,1,null,"enkelt",null,"Dansk",null,null,null,null,null,null,null,null,null,null,null,null,null,null,null,null,null,null,null,null,null,null,null,null,{"$f":"SUM(BV17:BV98)","v":500}]
[null,null,null,null,null,null,null,null,null,null,null,null,null,null,null,null,null,null,null,null,null,null,null,null,null,null,null,null,null,null,null,null,null,null,null,null,null,null,"Oliefyr",null,{"$f":"IF(AR5=\"Dansk\",\"Søjleradiator\",\"Column radiator\")","v":"Column radiator"},null,2,null,2,null,"dobbelt",null,"Engelsk"]
[null,"Living room 1",null,"Column radiator",{"$f":"G17/100","v":0.37},null,37,{"$f":"J17/100","v":0},null,null,null,2,null,2,null,58,null,"dobbelt",null,190,null,29,null,6,null,{"$f":"IF(SUM(BD17:BV17)=0,\" \",IF(CF17=\"Gulvvarme\",SUM(BD17:BV17),SUM(BD17:BV17)*((Beregn!C5)/Beregn!C5)^1.3))","v":" "},null,{"$f":"IF(SUM(BD17:BV17)=0,\" \",IF(CF17=\"Gulvvarme\",SUM(BD17:BV17),SUM(BD17:BV17)*((Beregn!J5)/Beregn!C5)^1.3))","v":" "},null,null,null,null,null,null,null,null,null,null,null,null,{"$f":"IF(AR5=\"Dansk\",\"Planradiator\",\"Planar radiator\")","v":"Planar radiator"},null,3,null,3,null,null,null,null,null,null,{"$f":"100*($CF17<>\"Gulvvarme\")*($CF17<>0)","v":100},{"$f":"IF($CF17<>\"Planradiator\",\"enkelt\",\"\")","v":"enkelt"},{"$f":"IF($CF17<>\"Planradiator\",\"dobbelt\",\"\")","v":"dobbelt"},{"$f":"\"\"","v":""},{"$f":"\"\"","v":""},{"$f":"IF($CF17=\"Panelradiator\",$E17*$H17*(-132.68*($E17^3)+801.68*($E17^2)-1099.6*$E17+1790.8),0)","v":0},{"$f":"IF($CF17=\"Panelradiator\",IF($L17>1,$E17*$H17*(-4178.9*($E17^3)+7784.1*($E17^2)-4877.7*$E17+2023.7),0))","v":false},{"$f":"IF($CF17=\"Panelradiator\",IF($L17>2,($L17-2)*$E17*$H17*(2439.3*($E17^3)-3252.2*($E17^2)+583.01*$E17+1150.4),0))","v":false},{"$f":"IF($CF17=\"Panelradiator\",IF($N17>0.5,$E17*$H17*(-1085.5*($E17^3)+1428.6*($E17^2)-532.97*$E17+688.74),0),0)","v":0},{"$f":"IF($CF17=\"Panelradiator\",IF($N17>1.5,($N17-1)*$E17*$H17*(6322*($E17^3)-12424*($E17^2)+7584.6*$E17-593.91),0),0)","v":0},{"$f":"IF($CF17=\"Panelradiator\",IF($L17>$N17,IF($N17>0.5,$H17*40,0),0),0)","v":0},null,{"$f":"IF($CF17=\"Konvektor\",$E17*$H17*457.27*($E17^-0.5155),0)","v":0},{"$f":"IF($CF17=\"Konvektor\",IF($L17>1,$E17*$H17*355.73*($E17^-0.4981),0))","v":false},{"$f":"IF($CF17=\"Konvektor\",IF($L17>2,($L17-2)*$E17*$H17*152.96*($E17^-0.8625),0),0)","v":0},{"$f":"IF($CF17=\"Konvektor\",$N17*$E17*$H17*455.51*($E17^-0.5469),0)","v":0},null,{"$f":"IF($CF17=\"Planradiator\",IF($R17=\"enkelt\",$E17*$H17*(-488.27*($E17^3)+1099.6*($E17^2)-835.09*$E17+394.42)*($P17^0.605),0))","v":false},{"$f":"IF($CF17=\"Planradiator\",IF($R17=\"dobbelt\",$E17*$H17*(-23.595*($E17^3)+70.632*($E17^2)-120.62*$E17+202.02)*($P17^0.725),0),0)","v":0},null,{"$f":"IF($CF17=\"søjleradiator\",0.83*V17*(957.42*$T17/1000*$E17+18.244),0)","v":0},null,{"$f":"IF($CF17=\"Gulvvarme\",$X17*50,0)","v":0},null,null,{"$f":"IF($CF17=\"Konvektor\",-999999999,IF($CF17=\"Panelradiator\",-999999999,999999999))","v":999999999},{"$f":"IF($CF17=\"Planradiator\",-999999999,999999999)","v":999999999},{"$f":"IF($CF17=\"Søjleradiator\",-999999999,999999999)","v":999999999},{"$f":"IF($CF17=\"Gulvvarme\",-999999999,999999999)","v":999999999},{"$f":"+SUM(BD17:BV17)","v":0},null,null,{"$f":"IF(OR(D17=\"Panelradiator\",D17=\"Panel radiator/convector\"),\"Panelradiator\",IF(OR(D17=\"Søjleradiator\",D17=\"Pillar radiator\"),\"Søjleradiator\",IF(OR(D17=\"Planradiator\",D17=\"Planar radiator\"),\"Planradiator\",IF(OR(D17=\"Konvektor\",D17=\"Convector\"),\"Konvektor\",IF(OR(D17=\"Gulvvarme\",D17=\"Underfloor heating\"),\"Gulvvarme\")))))","v":false}]
[null,null,null,null,null,null,null,null,null,null,null,null,null,null,null,null,null,null,null,null,null,null,null,null,null,null,null,null,null,null,null,null,null,null,null,null,null,null,null,null,{"$f":"IF(AR5=\"Dansk\",\"Konvektor\",\"Convector\")","v":"Convector"},null,null,null,4]
[null,null,null,null,0.6,null,60,{"$f":"J19/100","v":1.2},null,120,null,3,null,3,null,82,null,"enkelt",null,230,null,34,null,6,null,{"$f":"IF(SUM(BD19:BV19)=0,\" \",IF(CF19=\"Gulvvarme\",SUM(BD19:BV19),SUM(BD19:BV19)*((Beregn!C5)/Beregn!C5)^1.3))","v":" "},null,{"$f":"IF(SUM(BD19:BV19)=0,\" \",IF(CF19=\"Gulvvarme\",SUM(BD19:BV19),SUM(BD19:BV19)*((Beregn!J5)/Beregn!C5)^1.3))","v":" "},null,null,null,null,null,null,null,null,null,null,null,null,{"$f":"IF(AR5=\"Dansk\",\"Gulvvarme\",\"Underfloor heating\")","v":"Underfloor heating"},null,null,null,5,null,null,null,null,null,null,{"$f":"100*($CF19<>\"Gulvvarme\")*($CF19<>0)","v":100},{"$f":"IF($CF19<>\"Planradiator\",\"enkelt\",\"\")","v":"enkelt"},{"$f":"IF($CF19<>\"Planradiator\",\"dobbelt\",\"\")","v":"dobbelt"},{"$f":"IF(D17<>\"\",\"\",\"tom\")","v":""},{"$f":"IF(B17<>\"\",\"\",\"tom\")","v":""},{"$f":"IF($CF19=\"Panelradiator\",$E19*$H19*(-132.68*($E19^3)+801.68*($E19^2)-1099.6*$E19+1790.8),0)","v":0},{"$f":"IF($CF19=\"Panelradiator\",IF($L19>1,$E19*$H19*(-4178.9*($E19^3)+7784.1*($E19^2)-4877.7*$E19+2023.7),0))","v":false},{"$f":"IF($CF19=\"Panelradiator\",IF($L19>2,($L19-2)*$E19*$H19*(2439.3*($E19^3)-3252.2*($E19^2)+583.01*$E19+1150.4),0))","v":false},{"$f":"IF($CF19=\"Panelradiator\",IF($N19>0.5,$E19*$H19*(-1085.5*($E19^3)+1428.6*($E19^2)-532.97*$E19+688.74),0),0)","v":0},{"$f":"IF($CF19=\"Panelradiator\",IF($N19>1.5,($N19-1)*$E19*$H19*(6322*($E19^3)-12424*($E19^2)+7584.6*$E19-593.91),0),0)","v":0},{"$f":"IF($CF19=\"Panelradiator\",IF($L19>$N19,IF($N19>0.5,$H19*40,0),0),0)","v":0},null,{"$f":"IF($CF19=\"Konvektor\",$E19*$H19*457.27*($E19^-0.5155),0)","v":0},{"$f":"IF($CF19=\"Konvektor\",IF($L19>1,$E19*$H19*355.73*($E19^-0.4981),0))","v":false},{"$f":"IF($CF19=\"Konvektor\",IF($L19>2,($L19-2)*$E19*$H19*152.96*($E19^-0.8625),0),0)","v":0},{"$f":"IF($CF19=\"Konvektor\",$N19*$E19*$H19*455.51*($E19^-0.5469),0)","v":0},null,{"$f":"IF($CF19=\"Planradiator\",IF($R19=\"enkelt\",$E19*$H19*(-488.27*($E19^3)+1099.6*($E19^2)-835.09*$E19+394.42)*($P19^0.605),0))","v":false},{"$f":"IF($CF19=\"Planradiator\",IF($R19=\"dobbelt\",$E19*$H19*(-23.595*($E19^3)+70.632*($E19^2)-120.62*$E19+202.02)*($P19^0.725),0),0)","v":0},null,{"$f":"IF($CF19=\"søjleradiator\",0.83*V19*(957.42*$T19/1000*$E19+18.244),0)","v":0},null,{"$f":"IF($CF19=\"Gulvvarme\",$X19*50,0)","v":0},null,null,{"$f":"IF($CF19=\"Konvektor\",-999999999,IF($CF19=\"Panelradiator\",-999999999,999999999))","v":999999999},{"$f":"IF($CF19=\"Planradiator\",-999999999,999999999)","v":999999999},{"$f":"IF($CF19=\"Søjleradiator\",-999999999,999999999)","v":999999999},{"$f":"IF($CF19=\"Gulvvarme\",-999999999,999999999)","v":999999999},null,null,null,{"$f":"IF(OR(D19=\"Panelradiator\",D19=\"Panel radiator/convector\"),\"Panelradiator\",IF(OR(D19=\"Søjleradiator\",D19=\"Pillar radiator\"),\"Søjleradiator\",IF(OR(D19=\"Planradiator\",D19=\"Planar radiator\"),\"Planradiator\",IF(OR(D19=\"Konvektor\",D19=\"Convector\"),\"Konvektor\",IF(OR(D19=\"Gulvvarme\",D19=\"Underfloor heating\"),\"Gulvvarme\")))))","v":false}]
[null,null,null,null,null,null,null,null,null,null,null,null,null,null,null,null,null,null,null,null,null,null,null,null,null,null,null,null,null,null,null,null,null,null,null,null,null,null,null,null,null,null,null,null,6]
{"$rows_left_out":27}
{"sheet":"Definitions","index":4,"n_rows":31,"n_cols":20,"rows_kept":31,"cut":false,"hidden":false,"merged":[[9,6,13,8],[24,6,26,8],[30,6,32,7],[24,10,26,14]]}
[]
[null,{"$f":"IF('Heat emitters'!AR5=\"Dansk\",\"Panelradiator/konvektor\",\"Panel radiator/convector\")","v":"Panel radiator/convector"},null,null,null,null,null,null,null,null,{"$f":"IF('Heat emitters'!AR5=\"Dansk\",\"Planradiator\",\"Planar radiator\")","v":"Planar radiator"},null,null,null,null,null,null,null,null,{"$f":"IF('Heat emitters'!AR5=\"Dansk\",\"Søjleradiator\",\"Column radiator\")","v":"Column radiator"}]
[]
[]
[]
[]
[]
[]
[]
[null,null,null,null,null,null,{"$f":"IF('Heat emitters'!AR5=\"Dansk\",\"Panel-radiator med 3 paneler og  2 stk. konvektorblik\",\"Panel radiator/convector with 3 panels and 2 pcs. of convector veilings\")","v":"Panel radiator/convector with 3 panels and 2 pcs. of convector veilings"}]
[]
[]
[]
[]
[]
[]
[]
[]
[]
[]
{"$rows_left_out":12}
{"sheet":"Beregn","index":5,"n_rows":37,"n_cols":10,"rows_kept":37,"cut":false,"hidden":true,"merged":[]}
[]
[null,"Frem",90,75,60,60,60,60,null,{"$f":"'Heat emitters'!G5","v":60}]
[null,"Retur",70,65,50,50,50,50,null,{"$f":"'Heat emitters'!G7","v":40}]
[null,"Rum",20,20,20,20,20,20,null,{"$f":"'Heat emitters'!G9","v":20}]
[null,"Logmid",{"$f":"(C2-C3)/LN((C2-C4)/(C3-C4))","v":59.440268239769239},{"$f":"(D2-D3)/LN((D2-D4)/(D3-D4))","v":49.83288654563971},34.76059496782208,{"$f":"(F2-F3)/LN((F2-F4)/(F3-F4))","v":34.76059496782208},34.76059496782208,34.76059496782208,null,{"$f":"(J2-J3)/LN((J2-J4)/(J3-J4))","v":28.85390081777927}]
[]
[]
[null,"Installeret radiatoreffekt ved 90/70/20 °C",null,null,null,{"$f":"(SUM('Heat emitters'!$Z17:$Z64)-'Heat emitters'!BV15)/(((Beregning!J45-20)/Beregn!C5)^1.3)+0.1","v":28789.344169945372},null,null,{"$f":"F8*(D5/C5)^1.3","v":22892.732851572317}]
[]
[null,"Gulvvarme ved - 12 og ved -7",null,{"$f":"'Heat emitters'!BV15","v":500}]
[null,"GV andel",null,{"$f":"D10/Beregning!J33","v":7.3333333333333334E-2}]
[null,"Gv frem",null,{"$f":"Beregning!G41","v":36}]
[null,"GV retur ved -12",null,{"$f":"Beregning!G43","v":30}]
[]
[null,"Situation -12:"]
[null,"Ved -12 skal rad yde",null,{"$f":"MAX(0,Beregning!J33-Beregn!D10)","v":6318.181818181818}]
[null,"Nødvendig middel",null,{"$f":"(D16/$F$8)^(1/1.3)*$C$5+20","v":38.511212840122951}]
[]
[null,"Frem rad",null,{"$f":"MAX(D17+(Beregning!G37-Beregning!G39)/2*D16/Beregning!J47,D12)","v":41.213110997017672},null,{"$f":"D19-D16/Beregning!J47*(Beregning!G37-Beregning!G39)","v":35.809314683228223}]
[null,"Retur",null,{"$f":"D19-2*(D19-D17)","v":35.80931468322823},null,{"$f":"D19-2*(D19-D17)","v":35.80931468322823}]
{"$rows_left_out":18}
{"sheet":"Ark2","index":6,"n_rows":0,"n_cols":0,"rows_kept":0,"cut":false,"hidden":true,"merged":[]}

{"sheet":"Ark3","index":7,"n_rows":0,"n_cols":0,"rows_kept":0,"cut":false,"hidden":true,"merged":[]}